Stack Exchange Network

Stack Exchange network consists of 174 Q&A communities including Stack Overflow, the largest, most trusted online community for developers to learn, share their knowledge, and build their careers.

Visit Stack Exchange
Join us in building a kind, collaborative learning community via our updated Code of Conduct.

Questions tagged [runtime-error]

The tag has no usage guidance.

-2
votes
0answers
40 views

Error message when running macro?

I receive this error message every time I try to run one of my macros. Why is it popping up and what does it mean? CODE: Sub Delete() ' ' Delete Macro ' ' Keyboard Shortcut: Ctrl+Shift+D ' ...
0
votes
3answers
48 views

Excel VBA error management

I read this thread on error handling, but when I try to replicate even a simple error management scenario it won't work. I'm trying to run the following modified code from one of the examples: Sub ...
0
votes
1answer
119 views

VBA error 1004 while exporting to PDF

Hi Guys I really need assistance with the below code. I am using the following codes to import data into Excel: Option Explicit Private Sub CommandButton1_Click() Const FULL_PATH = "C:\Users\...
0
votes
0answers
39 views

Explorer Windows Stopped Working (How to make it autorestart program)?

When some application under windows os stopped working, it appeared as this picture. And the cursor & keyboard input become slow... I wonder, how to automatically choose "Restart Program" without ...
2
votes
1answer
1k views

npm install can't access folder (no Permission)

i'm trying to install storjshare-daemon on ubuntu and i'm following the guide but when i'm using npm it keeps showing the same error , i try everything like setting public key on github and Check ...
0
votes
0answers
670 views

collect2: error: ld returned 1 exit status Makefile:107: recipe for target ‘binary’ failed make: *** [binary] Error 1

I am trying to compile ChatScript V7.55 on Ubuntu 16.04 but I got this error message: collect2: error: ld returned 1 exit status Makefile:107: recipe for target ‘binary’ failed make: *** [binary] ...
0
votes
0answers
28 views

Losing Brave browser pages

I've been using Brave for a while now, but cannot recommend it. Pages regularly obtain the status: "Error". At which point they become totally useless, including the loss of history. I always continue ...
0
votes
0answers
336 views

Run-Time Error 1004: MS Excel is refreshing some data. Please try again later using Query

I have a dynamic query in a sheet that has a parameter in cell C1. So, In column A there are codes, and in column b are those code descriptions and based on the value in cell C1, the query will ...
1
vote
0answers
40 views

Application/object error during paste special operation

I have been working in this code for a week now, I'm kind of new to VBA and am close to getting it to do what I need it to but I keep getting a "Aplication-defined or object-defined error" on the last ...
0
votes
1answer
317 views

Why am I getting this error in “pip install ephem”?

xcrun: error: invalid active developer path (/Library/Developer/CommandLineTools), missing xcrun at: /Library/Developer/CommandLineTools/usr/bin/xcrun error: command '/usr/bin/clang' failed with exit ...
0
votes
1answer
138 views

Object expected Microsoft JScript runtime error 800A138F when viewing diffs inside of TortoiseSVN update log

After I get an update, I double click a JavaScript file in my update log and get the following error message: I've tried clearing everything inside of Settings -> Saved Data but I still get errors. I'...
1
vote
1answer
20 views

Beeping on startup and keyboard light stays on

When I startup my pc (which I recently built), it sometimes gives a few beeps and proceeds to start up. Is this a bad sign or can anyone tell me more about this? Also I have a led keyboard which ...
0
votes
0answers
124 views

Microsoft Access query is too complex - IF formula

I have a query in Access Database and when I try to run it, I get an error message "query is too complex to run." Runtime error 3360." The problem is with one formula / programming logic, see below: ...
0
votes
0answers
92 views

Install plugin in codeblocks

When I open codeblocks I get a warning and I can't run any program. After few times codeblocks close is enough. My OS is Kali Linux. How do I resolve this?
0
votes
1answer
130 views

Looping and executing ls in a bash script, Resource Temporarily Unavilable?

I have a process that takes hours at a time sometimes to complete, and instead of running ls to see if an associated file gets deleted to mark the completion of the task, I have a script that simply ...

15 30 50 per page